Target
Muscarinic acetylcholine receptor M1
Ligand
BDBM50112164
Substrate
Meas. Tech.
ChEMBL_1512946 (CHEMBL3609985)
EC50
71±n/a nM
Citation
 Blass, B Pyrrolopyridine or Pyrazolopyridine Derivatives. ACS Med Chem Lett 6:726-8 (2015)  
Target
Name:
Muscarinic acetylcholine receptor M1
Synonyms:
ACM1_RAT Chrm-1 cholinergic receptor, muscarinic 1
Type:
Enzyme Catalytic Domain
Mol. Mass.:
51390.46
Organism:
RAT
Description:
P08482
Residue:
460
  
Inhibitor
Name:
BDBM50112164
Synonyms:
CHEMBL3608420
Type:
Small organic molecule
Emp. Form.:
C23H24N6O3
Mol. Mass.:
432.4751
SMILES:
Cn1cc(cn1)-c1ccc(Cn2cc(C(=O)N[C@H]3COCC[C@@H]3O)c3ncccc23)cn1
: