Target
Neuromedin-K receptor
Ligand
BDBM50112244
Substrate
Meas. Tech.
ChEMBL_1512994 (CHEMBL3610107)
Ki
219±n/a nM
Citation
 Hoveyda, HRFraser, GLDutheuil, GEl Bousmaqui, MKorac, JLenoir, FLapin, ANoël, S Optimization of Novel Antagonists to the Neurokinin-3 Receptor for the Treatment of Sex-Hormone Disorders (Part II). ACS Med Chem Lett 6:736-40 (2015)  
Target
Name:
Neuromedin-K receptor
Synonyms:
NK3R_RAT Tac3r | Tacr3
Type:
Mol. Mass.:
51128.60
Organism:
Rattus norvegicus
Description:
ChEMBL_10983
Residue:
452
  
Inhibitor
Name:
BDBM50112244
Synonyms:
CHEMBL3608680 US10836768, Cpd no 5 US9422299, 5 | US9987274, Compound 5
Type:
Small organic molecule
Emp. Form.:
C16H15FN6OS
Mol. Mass.:
358.393
SMILES:
C[C@H]1N(CCn2c1nnc2-c1nc(C)ns1)C(=O)c1ccc(F)cc1
: