Target
Neuromedin-K receptor
Ligand
BDBM50112245
Substrate
Meas. Tech.
ChEMBL_1512994 (CHEMBL3610107)
Ki
244±n/a nM
Citation
 Hoveyda, HRFraser, GLDutheuil, GEl Bousmaqui, MKorac, JLenoir, FLapin, ANoël, S Optimization of Novel Antagonists to the Neurokinin-3 Receptor for the Treatment of Sex-Hormone Disorders (Part II). ACS Med Chem Lett 6:736-40 (2015)  
Target
Name:
Neuromedin-K receptor
Synonyms:
NK3R_RAT Tac3r | Tacr3
Type:
Mol. Mass.:
51128.60
Organism:
Rattus norvegicus
Description:
ChEMBL_10983
Residue:
452
  
Inhibitor
Name:
BDBM50112245
Synonyms:
CHEMBL3608741 US10836768, Cpd no 11 US9422299, 11 | US9987274, Compound 11
Type:
Small organic molecule
Emp. Form.:
C17H17FN6O2S
Mol. Mass.:
388.419
SMILES:
Cc1nsc(n1)-c1nnc2[C@@H](CCO)N(CCn12)C(=O)c1ccc(F)cc1
: