Target
Bromodomain-containing protein 4
Ligand
BDBM50112336
Substrate
Meas. Tech.
ChEMBL_1513099 (CHEMBL3610436)
Ki
54±n/a nM
Citation
 Chen, LYap, JLYoshioka, MLanning, MEFountain, RNRaje, MScheenstra, JAStrovel, JWFletcher, S BRD4 Structure-Activity Relationships of Dual PLK1 Kinase/BRD4 Bromodomain Inhibitor BI-2536. ACS Med Chem Lett 6:764-9 (2015)  
Target
Name:
Bromodomain-containing protein 4
Synonyms:
BRD4 Bromodomain-containing protein 4 (BRD4) Protein HUNK1
Type:
Protein
Mol. Mass.:
152264.84
Organism:
Homo sapiens (Human)
Description:
O60885
Residue:
1362
  
Inhibitor
Name:
BDBM50112336
Synonyms:
CHEMBL3609305
Type:
Small organic molecule
Emp. Form.:
C28H39N7O3
Mol. Mass.:
521.6544
SMILES:
CC[C@@H]1N(C2CCCC2)c2nc(Nc3ccc(cc3OC)C(=O)NC3CCN(C)CC3)ncc2N(C)C1=O
: