Target
Serine/threonine-protein kinase PLK1
Ligand
BDBM50112339
Substrate
Meas. Tech.
ChEMBL_1513100 (CHEMBL3610437)
Ki
5.8±n/a nM
Citation
 Chen, LYap, JLYoshioka, MLanning, MEFountain, RNRaje, MScheenstra, JAStrovel, JWFletcher, S BRD4 Structure-Activity Relationships of Dual PLK1 Kinase/BRD4 Bromodomain Inhibitor BI-2536. ACS Med Chem Lett 6:764-9 (2015)  
Target
Name:
Serine/threonine-protein kinase PLK1
Synonyms:
PLK PLK1 Polo-like kinase 1 (PlK1) STPK13 Serine/threonine-protein kinase 13 | polo-like kinase
Type:
Serine/threonine-protein kinase
Mol. Mass.:
68277.16
Organism:
Homo sapiens (Human)
Description:
P53350
Residue:
603
  
Inhibitor
Name:
BDBM50112339
Synonyms:
CHEMBL3609308
Type:
Small organic molecule
Emp. Form.:
C30H36BrN7O3
Mol. Mass.:
622.556
SMILES:
CC[C@H]1N(Cc2cccc(Br)c2)c2nc(Nc3ccc(cc3OC)C(=O)NC3CCN(C)CC3)ncc2N(C)C1=O
: