Target
Receptor-type tyrosine-protein phosphatase gamma
Ligand
BDBM50420258
Substrate
Meas. Tech.
ChEMBL_1513407 (CHEMBL3611562)
IC50
>200000±n/a nM
Citation
 He, RYu, ZHZhang, RYWu, LGunawan, AMLane, BSShim, JSZeng, LFHe, YChen, LWells, CDLiu, JOZhang, ZY Exploring the Existing Drug Space for Novel pTyr Mimetic and SHP2 Inhibitors. ACS Med Chem Lett 6:782-6 (2015)  
Target
Name:
Receptor-type tyrosine-protein phosphatase gamma
Synonyms:
PTPG PTPRG_HUMAN Protein-tyrosine phosphatase gamma (PTPG) Receptor-type tyrosine-protein phosphatase gamma (PTPgamma)
Type:
Protein
Mol. Mass.:
161998.07
Organism:
Homo sapiens (Human)
Description:
P23470
Residue:
1445
  
Inhibitor
Name:
BDBM50420258
Synonyms:
CEFSULODIN
Type:
Small organic molecule
Emp. Form.:
C22H21N4O8S2
Mol. Mass.:
533.554
SMILES:
NC(=O)c1cc[n+](CC2=C(N3[C@H](SC2)[C@H](NC(=O)C(c2ccccc2)S(O)(=O)=O)C3=O)C(O)=O)cc1
: