Target
Tyrosine-protein phosphatase non-receptor type 9
Ligand
BDBM50112356
Substrate
Meas. Tech.
ChEMBL_1513403 (CHEMBL3611558)
IC50
>50000±n/a nM
Citation
 He, RYu, ZHZhang, RYWu, LGunawan, AMLane, BSShim, JSZeng, LFHe, YChen, LWells, CDLiu, JOZhang, ZY Exploring the Existing Drug Space for Novel pTyr Mimetic and SHP2 Inhibitors. ACS Med Chem Lett 6:782-6 (2015)  
Target
Name:
Tyrosine-protein phosphatase non-receptor type 9
Synonyms:
3.1.3.48 PTP-MEG2 PTPase MEG2 Protein-tyrosine phosphatase MEG2 (PTP-Meg2) | Tyrosine-protein phosphatase non-receptor type 9
Type:
Mol. Mass.:
68030.33
Organism:
Homo sapiens (Human)
Description:
P43378
Residue:
593
  
Inhibitor
Name:
BDBM50112356
Synonyms:
CHEMBL3609373
Type:
Small organic molecule
Emp. Form.:
C22H18IN3O6S
Mol. Mass.:
579.364
SMILES:
OS(=O)(=O)C(C(=O)Nc1ccc(NC(=O)C(=O)Nc2ccc(I)cc2)cc1)c1ccccc1
: