Target
Nuclear receptor ROR-gamma
Ligand
BDBM50112367
Substrate
Meas. Tech.
ChEMBL_1513553 (CHEMBL3610010)
IC50
4.0±n/a nM
Citation
 Wang, YCai, WCheng, YYang, TLiu, QZhang, GMeng, QHan, FHuang, YZhou, LXiang, ZZhao, YGXu, YCheng, ZLu, SWu, QXiang, JNElliott, JDLeung, SRen, FLin, X Discovery of Biaryl Amides as Potent, Orally Bioavailable, and CNS Penetrant ROR¿t Inhibitors. ACS Med Chem Lett 6:787-92 (2015)  
Target
Name:
Nuclear receptor ROR-gamma
Synonyms:
NR1F3 Nuclear receptor ROR-gamma (RORC) RAR-related orphan receptor C (RORc) RORG RZRG Retinoid-related orphan receptor-gamma (RORc)
Type:
Enzyme Catalytic Domain
Mol. Mass.:
58218.40
Organism:
Homo sapiens (Human)
Description:
P51449
Residue:
518
  
Inhibitor
Name:
BDBM50112367
Synonyms:
CHEMBL3609407
Type:
Small organic molecule
Emp. Form.:
C23H18Cl2F3NO4S
Mol. Mass.:
532.36
SMILES:
CCS(=O)(=O)c1ccc(CC(=O)Nc2cc(Cl)c(c(Cl)c2)-c2ccccc2OC(F)(F)F)cc1
: