Target
Discoidin domain-containing receptor 2
Ligand
BDBM50112634
Substrate
Meas. Tech.
ChEMBL_1513724 (CHEMBL3610834)
IC50
6.1±n/a nM
Citation
 Murray, CWBerdini, VBuck, IMCarr, MECleasby, ACoyle, JECurry, JEDay, JEDay, PJHearn, KIqbal, ALee, LYMartins, VMortenson, PNMunck, JMPage, LWPatel, SRoomans, SSmith, KTamanini, ESaxty, G Fragment-Based Discovery of Potent and Selective DDR1/2 Inhibitors. ACS Med Chem Lett 6:798-803 (2015)  
Target
Name:
Discoidin domain-containing receptor 2
Synonyms:
DDR2 Discoidin domain receptor 2 (DDR2) Discoidin domain-containing receptor 2 (DDR2) NTRKR3 TYRO10
Type:
Protein
Mol. Mass.:
96717.07
Organism:
Homo sapiens (Human)
Description:
Q16832
Residue:
855
  
Inhibitor
Name:
BDBM50112634
Synonyms:
CHEMBL3608791
Type:
Small organic molecule
Emp. Form.:
C24H20FN5O2
Mol. Mass.:
429.4463
SMILES:
C[C@H](Nc1nc2cc(F)ccc2o1)c1ccc(C)c(NC(=O)c2cnc3ccccn23)c1
: