Target
Melanocortin receptor 5
Ligand
BDBM50112908
Substrate
Meas. Tech.
ChEMBL_1508716 (CHEMBL3602979)
EC50
>5000±n/a nM
Citation
 Cai, MMarelli, UKBao, JBeck, JGOpperer, FRechenmacher, FMcLeod, KRZingsheim, MRDoedens, LKessler, HHruby, VJ Systematic Backbone Conformational Constraints on a Cyclic Melanotropin Ligand Leads to Highly Selective Ligands for Multiple Melanocortin Receptors. J Med Chem 58:6359-67 (2015)  
Target
Name:
Melanocortin receptor 5
Synonyms:
MC-2 MC5R Melanocortin MC5 Melanocortin receptor 5 | Melanocortin receptor 5 (MC5R)
Type:
Enzyme
Mol. Mass.:
36612.92
Organism:
Homo sapiens (Human)
Description:
P33032
Residue:
325
  
Inhibitor
Name:
BDBM50112908
Synonyms:
CHEMBL3600919
Type:
Small organic molecule
Emp. Form.:
C57H77N15O9
Mol. Mass.:
1116.3164
SMILES:
CCCC[C@@H](NC(C)=O)C(=O)N[C@H]1CC(=O)NCCCC[C@H](N(C)C(=O)[C@H](Cc2c[nH]c3ccccc23)NC(=O)[C@H](CCCNC(N)=N)NC(=O)[C@@H](Cc2ccc3ccccc3c2)N(C)C(=O)[C@H](Cc2cnc[nH]2)N(C)C1=O)C(N)=O
: