Target
C-C chemokine receptor type 9
Ligand
BDBM50113439
Substrate
Meas. Tech.
ChEMBL_1510357 (CHEMBL3607107)
IC50
1750±n/a nM
Citation
 Zhang, JRomero, JChan, AGoss, JStucka, SCross, JChamberlain, BVaroglu, MChandonnet, HRyan, DLippa, B Biarylsulfonamide CCR9 inhibitors for inflammatory bowel disease. Bioorg Med Chem Lett 25:3661-4 (2015)  
Target
Name:
C-C chemokine receptor type 9
Synonyms:
CCR9 GPR28
Type:
PROTEIN
Mol. Mass.:
42023.90
Organism:
Homo sapiens (Human)
Description:
ChEMBL_1510356
Residue:
369
  
Inhibitor
Name:
BDBM50113439
Synonyms:
CHEMBL3604481
Type:
Small organic molecule
Emp. Form.:
C21H21ClN2O4S
Mol. Mass.:
432.92
SMILES:
CC(C)(C)c1ccc(cc1)S(=O)(=O)Nc1ccc(Cl)cc1-c1c(O)ccc[n+]1[O-]
: