Target
C-C chemokine receptor type 9
Ligand
BDBM50113447
Substrate
Meas. Tech.
ChEMBL_1510356 (CHEMBL3607106)
IC50
89±n/a nM
Citation
 Zhang, JRomero, JChan, AGoss, JStucka, SCross, JChamberlain, BVaroglu, MChandonnet, HRyan, DLippa, B Biarylsulfonamide CCR9 inhibitors for inflammatory bowel disease. Bioorg Med Chem Lett 25:3661-4 (2015)  
Target
Name:
C-C chemokine receptor type 9
Synonyms:
CCR9 GPR28
Type:
PROTEIN
Mol. Mass.:
42023.90
Organism:
Homo sapiens (Human)
Description:
ChEMBL_1510356
Residue:
369
  
Inhibitor
Name:
BDBM50113447
Synonyms:
CHEMBL3604478
Type:
Small organic molecule
Emp. Form.:
C22H23ClN2O3S
Mol. Mass.:
430.948
SMILES:
CC(C)(C)c1ccc(cc1)S(=O)(=O)Nc1ccc(Cl)cc1-c1ncccc1CO
: