Target
Cytochrome P450 2C19
Ligand
BDBM50113476
Substrate
Meas. Tech.
ChEMBL_1510828 (CHEMBL3606592)
IC50
<15849±n/a nM
Citation
 Christopher, JAAves, SJBennett, KADoré, ASErrey, JCJazayeri, AMarshall, FHOkrasa, KSerrano-Vega, MJTehan, BGWiggin, GRCongreve, M Fragment and Structure-Based Drug Discovery for a Class C GPCR: Discovery of the mGlu5 Negative Allosteric Modulator HTL14242 (3-Chloro-5-[6-(5-fluoropyridin-2-yl)pyrimidin-4-yl]benzonitrile). J Med Chem 58:6653-64 (2015)  
Target
Name:
Cytochrome P450 2C19
Synonyms:
CP2CJ_HUMAN CYPIIC17 Cytochrome P450 2C19 (CYP2C19) Mephenytoin 4-hydroxylase P450-254C
Type:
Enzyme
Mol. Mass.:
55935.47
Organism:
Homo sapiens (Human)
Description:
P33261
Residue:
490
  
Inhibitor
Name:
BDBM50113476
Synonyms:
CHEMBL3603923 US10584111, Ex No. 17 | US11584732, Example 17
Type:
Small organic molecule
Emp. Form.:
C16H8ClFN4
Mol. Mass.:
310.713
SMILES:
Fc1ccc(nc1)-c1cc(ncn1)-c1cc(Cl)cc(c1)C#N
: