Target
ALK tyrosine kinase receptor
Ligand
BDBM50113629
Substrate
Meas. Tech.
ChEMBL_1510512 (CHEMBL3607640)
IC50
4.0±n/a nM
Citation
 Zhang, PDong, JZhong, BZhang, DJin, CMeng, XSun, DXu, XZhou, YLiang, ZJi, MLi, HXu, TSong, GZhang, LChen, GYuan, HShih, JZhang, RHou, GJin, YYang, Q Discovery of 2-arylamino-4-(1-methyl-3-isopropylsulfonyl-4-pyrazol-amino)pyrimidines as potent anaplastic lymphoma kinase (ALK) inhibitors. Bioorg Med Chem Lett 25:3738-43 (2015)  
Target
Name:
ALK tyrosine kinase receptor
Synonyms:
ALK ALK_HUMAN CD_antigen: CD246
Type:
Protein
Mol. Mass.:
176453.10
Organism:
Homo sapiens (Human)
Description:
Q9UM73
Residue:
1620
  
Inhibitor
Name:
BDBM50113629
Synonyms:
CHEMBL3604632
Type:
Small organic molecule
Emp. Form.:
C27H38ClN7O3S
Mol. Mass.:
576.154
SMILES:
CC(C)Oc1cc(C2CCN(C)CC2)c(C)cc1Nc1ncc(Cl)c(Nc2cn(C)nc2S(=O)(=O)C(C)C)n1
: