Target
Sphingosine 1-phosphate receptor 1
Ligand
BDBM50114067
Substrate
Meas. Tech.
ChEMBL_1511039 (CHEMBL3607180)
EC50
57±n/a nM
Citation
 Hennessy, EJOza, VAdam, AByth, KCastriotta, LGrewal, GHamilton, GAKamhi, VMLewis, PLi, DLyne, Pึster, LRooney, MTSaeh, JCSha, LSu, QWen, SXue, YYang, B Identification and Optimization of Benzimidazole Sulfonamides as Orally Bioavailable Sphingosine 1-Phosphate Receptor 1 Antagonists with in Vivo Activity. J Med Chem 58:7057-75 (2015)  
Target
Name:
Sphingosine 1-phosphate receptor 1
Synonyms:
CHEDG1 Endothelial differentiation G-protein coupled receptor 1 S1P1 S1PR1_HUMAN Sphingosine 1-phosphate receptor Edg-1
Type:
Enzyme
Mol. Mass.:
42836.02
Organism:
Homo sapiens (Human)
Description:
P21453
Residue:
382
  
Inhibitor
Name:
BDBM50114067
Synonyms:
CHEMBL3605537
Type:
Small organic molecule
Emp. Form.:
C19H17F3N4O2S
Mol. Mass.:
422.424
SMILES:
CCn1c(nc2ccc(cc12)C(F)(F)F)[C@@H](C)NS(=O)(=O)c1cccc(c1)C#N
: