Target
Dual specificity tyrosine-phosphorylation-regulated kinase 1A
Ligand
BDBM50114575
Substrate
Meas. Tech.
ChEMBL_1512190 (CHEMBL3611472)
IC50
80000±n/a nM
Citation
 Boulahjar, ROuach, ABourg, SBonnet, PLozach, OMeijer, LGuguen-Guillouzo, CLe Guevel, RLazar, SAkssira, MTroin, YGuillaumet, GRoutier, S Advances in tetrahydropyrido[1,2-a]isoindolone (valmerins) series: Potent glycogen synthase kinase 3 and cyclin dependent kinase 5 inhibitors. Eur J Med Chem 101:274-87 (2015)  
Target
Name:
Dual specificity tyrosine-phosphorylation-regulated kinase 1A
Synonyms:
DYR1A_HUMAN DYRK1A Dual specificity YAK1-related kinase 1A (Dyrk1A) Dual-specificity tyrosine-phosphorylation regulated kinase 1A HP86 MNBH
Type:
Enzyme
Mol. Mass.:
85616.61
Organism:
Homo sapiens (Human)
Description:
Q13627
Residue:
763
  
Inhibitor
Name:
BDBM50114575
Synonyms:
CHEMBL3609564
Type:
Small organic molecule
Emp. Form.:
C20H20N4O4
Mol. Mass.:
380.3972
SMILES:
O=C(Nc1ccccn1)Nc1cccc2C(=O)N3CCC4(CC3c12)OCCO4
: