Target
Gamma-secretase subunit APH-1A/Gamma-secretase subunit APH-1B/Gamma-secretase subunit PEN-2/Nicastrin/Presenilin-1/Presenilin-2
Ligand
BDBM50114844
Substrate
Meas. Tech.
ChEMBL_1512319 (CHEMBL3611870)
IC50
62±n/a nM
Citation
 Methot, JLFischer, CLi, CRivkin, AAhearn, SPBrown, WCKattar, SKelley, EMampreian, DMSchell, ARosenau, AZhou, HBall, RDeshmukh, SVJeliazkova-Mecheva, VVDiaz, DMoy, LYKenific, CMMoxham, CShah, SNuthall, HSzewczak, AAHill, AHughes, BSmotrov, NMunoz, BMiller, TAShearman, MS Potent benzoazepinoneż-secretase modulators with improved bioavailability. Bioorg Med Chem Lett 25:3495-500 (2015)  
Target
Name:
Gamma-secretase subunit APH-1A/Gamma-secretase subunit APH-1B/Gamma-secretase subunit PEN-2/Nicastrin/Presenilin-1/Presenilin-2
Synonyms:
Gamma-Secretase Subunit APH-1A/Gamma-Secretase Subunit PEN-2/Gamma-Secretase Subunit Presenilin-1/Gamma-secretase subunit APH-1B/Nicastrin /Presenilin 2 Gamma-secretase subunit APH-1A/Gamma-secretase subunit APH-1B/Gamma-secretase subunit PEN-2/Nicastrin /Presenilin 1/Presenilin 2
Type:
Mol. Mass.:
Description:
ASSAY_ID of EBI is 68900
Components:
This complex has 6 components.
Component 1
Name:
Gamma-secretase subunit APH-1B
Synonyms:
APH-1b APH1B_HUMAN Gamma-secretase PSFL | Presenilin-stabilization factor-like
Type:
PROTEIN
Mol. Mass.:
28468.17
Organism:
Homo sapiens (Human)
Description:
EBI_10231
Residue:
257
  
Component 2
Name:
Presenilin-2
Synonyms:
AD3LP AD5 Gamma-secretase PS2 PSN2_HUMAN Presenilin 2 Presenilin-2 CTF subunit STM-2 | STM2
Type:
PROTEIN
Mol. Mass.:
50116.65
Organism:
Homo sapiens (Human)
Description:
ChEMBL_855576
Residue:
448
  
Component 3
Name:
Gamma-secretase subunit APH-1A
Synonyms:
APH-1a APH1A_HUMAN Gamma-Secretase Subunit APH-1A Presenilin-stabilization factor
Type:
Enzyme subunit; multi-pass membrane protein
Mol. Mass.:
28998.73
Organism:
Homo sapiens (Human)
Description:
Residue:
265
  
Component 4
Name:
Nicastrin
Synonyms:
Gamma-secretase NCSTN Nicastrin
Type:
PROTEIN
Mol. Mass.:
78404.96
Organism:
Homo sapiens (Human)
Description:
EBI_10683
Residue:
709
  
Component 5
Name:
Presenilin-1
Synonyms:
3.4.23.- Gamma-Secretase Subunit Presenilin-1 PS1 PSEN1 PSNL1 Presenilin-1 CTF12 Protein S182
Type:
Mol. Mass.:
52657.13
Organism:
Homo sapiens (Human)
Description:
P49768
Residue:
467
  
Component 6
Name:
Gamma-secretase subunit PEN-2
Synonyms:
Gamma-Secretase Subunit PEN-2 PEN2 PSENEN | Presenilin enhancer protein 2
Type:
Enzyme subunit; multi-pass membrane protein
Mol. Mass.:
12031.98
Organism:
Homo sapiens (Human)
Description:
Residue:
101
  
Inhibitor
Name:
BDBM50114844
Synonyms:
CHEMBL3608391
Type:
Small organic molecule
Emp. Form.:
C21H17F4N7OS
Mol. Mass.:
491.465
SMILES:
Cc1cn(cn1)-c1ncc(s1)-c1cn(nn1)[C@H]1CCc2c(F)cccc2N(CC(F)(F)F)C1=O
: