Target
Prothrombin
Ligand
BDBM50115491
Substrate
Meas. Tech.
ChEMBL_1513929 (CHEMBL3611611)
Kd
270±n/a nM
Citation
 Rühmann, EBetz, MHeine, AKlebe, G Fragment Binding Can Be Either More Enthalpy-Driven or Entropy-Driven: Crystal Structures and Residual Hydration Patterns Suggest Why. J Med Chem 58:6960-71 (2015)  
Target
Name:
Prothrombin
Synonyms:
Activation peptide fragment 1 Coagulation factor II Prothrombin precursor Thrombin heavy chain | Thrombin light chain
Type:
Protein
Mol. Mass.:
70029.57
Organism:
Homo sapiens (Human)
Description:
P00734
Residue:
622
  
Inhibitor
Name:
BDBM50115491
Synonyms:
CHEMBL3608988
Type:
Small organic molecule
Emp. Form.:
C21H23Cl2N3O2
Mol. Mass.:
420.332
SMILES:
N[C@@H](Cc1ccccc1)C(=O)N1CCC[C@H]1C(=O)NCc1cc(Cl)ccc1Cl
: