Target
Prothrombin
Ligand
BDBM50038002
Substrate
Meas. Tech.
ChEMBL_1513930 (CHEMBL3611612)
Kd
455000±n/a nM
Citation
 Rühmann, EBetz, MHeine, AKlebe, G Fragment Binding Can Be Either More Enthalpy-Driven or Entropy-Driven: Crystal Structures and Residual Hydration Patterns Suggest Why. J Med Chem 58:6960-71 (2015)  
Target
Name:
Prothrombin
Synonyms:
Activation peptide fragment 1 Coagulation factor II Prothrombin precursor Thrombin heavy chain | Thrombin light chain
Type:
Protein
Mol. Mass.:
70029.57
Organism:
Homo sapiens (Human)
Description:
P00734
Residue:
622
  
Inhibitor
Name:
BDBM50038002
Synonyms:
Benzamidine (Protonated) CHEMBL537204 | benzamidine
Type:
Small organic molecule
Emp. Form.:
C7H8N2
Mol. Mass.:
120.1518
SMILES:
NC(=N)c1ccccc1
: