Target
Monoglyceride lipase
Ligand
BDBM50118168
Substrate
Meas. Tech.
ChEMBL_1514638 (CHEMBL3614385)
IC50
7940±n/a nM
Citation
 Patel, JZvan Bruchem, JLaitinen, TKaczor, AANavia-Paldanius, DParkkari, TSavinainen, JRLaitinen, JTNevalainen, TJ Revisiting 1,3,4-Oxadiazol-2-ones: Utilization in the Development of ABHD6 Inhibitors. Bioorg Med Chem 23:6335-45 (2015)  
Target
Name:
Monoglyceride lipase
Synonyms:
HU-K5 Lysophospholipase-like MGL MGLL_HUMAN
Type:
Hydrolase
Mol. Mass.:
33264.56
Organism:
Homo sapiens (Human)
Description:
Human recombinant MGL (Cayman Chemical, cat# 10008354).
Residue:
303
  
Inhibitor
Name:
BDBM50118168
Synonyms:
CHEMBL3613162
Type:
Small organic molecule
Emp. Form.:
C15H13N3O3
Mol. Mass.:
283.282
SMILES:
Nc1cccc(Cn2nc(Oc3ccccc3)oc2=O)c1
: