Target
Purine nucleoside phosphorylase
Ligand
BDBM50247151
Substrate
Meas. Tech.
ChEMBL_1511505 (CHEMBL3606854)
Ki
0.070000±n/a nM
Citation
 Evans, GBCameron, SALuxenburger, AGuan, RSuarez, JThomas, KSchramm, VLTyler, PC Tight binding enantiomers of pre-clinical drug candidates. Bioorg Med Chem 23:5326-33 (2015)  
Target
Name:
Purine nucleoside phosphorylase
Synonyms:
Inosine phosphorylase NP PNPH_HUMAN | Purine nucleoside phosphorylase (PNPase)
Type:
Enzyme
Mol. Mass.:
32119.53
Organism:
Homo sapiens (Human)
Description:
Residue:
289
  
Inhibitor
Name:
BDBM50247151
Synonyms:
7-(((3R,4S)-3-hydroxy-4-(methylthiomethyl)pyrrolidin-1-yl)methyl)-3H-pyrrolo[3,2-d]pyrimidin-4(5H)-one US9290501, (C)
Type:
Small organic molecule
Emp. Form.:
C13H18N4O2S
Mol. Mass.:
294.373
SMILES:
CSC[C@H]1CN(Cc2c[nH]c3c2nc[nH]c3=O)C[C@@H]1O
: