Target
Carbonic anhydrase 1
Ligand
BDBM50116438
Substrate
Meas. Tech.
ChEMBL_1511757 (CHEMBL3607714)
Ki
940±n/a nM
Citation
 Mollica, ACostante, RAkdemir, ACarradori, SStefanucci, AMacedonio, GCeruso, MSupuran, CT Exploring new Probenecid-based carbonic anhydrase inhibitors: Synthesis, biological evaluation and docking studies. Bioorg Med Chem 23:5311-8 (2015)  
Target
Name:
Carbonic anhydrase 1
Synonyms:
CA-I CAB Carbonate dehydratase I Carbonic anhydrase 1 (CA I) Carbonic anhydrase 1 (Recombinant CA I) Carbonic anhydrase B Carbonic anhydrase I (CA I) Carbonic anhydrase I (CAI) Carbonic anhydrase isoenzyme I (hCA I) | hCA
Type:
Enzyme
Mol. Mass.:
28873.37
Organism:
Homo sapiens (Human)
Description:
P00915
Residue:
261
  
Inhibitor
Name:
BDBM50116438
Synonyms:
CHEMBL3604414
Type:
Small organic molecule
Emp. Form.:
C16H24N2O5S2
Mol. Mass.:
388.502
SMILES:
CCCN(CCC)S(=O)(=O)c1ccc(cc1)C(=O)N[C@@H](CS)C(O)=O
: