Target
Carbonic anhydrase 12
Ligand
BDBM50116389
Substrate
Meas. Tech.
ChEMBL_1511811 (CHEMBL3608013)
Ki
78±n/a nM
Citation
 Mollica, ACostante, RAkdemir, ACarradori, SStefanucci, AMacedonio, GCeruso, MSupuran, CT Exploring new Probenecid-based carbonic anhydrase inhibitors: Synthesis, biological evaluation and docking studies. Bioorg Med Chem 23:5311-8 (2015)  
Target
Name:
Carbonic anhydrase 12
Synonyms:
CA-XII CAH12_HUMAN Carbonic anhydrase Carbonic anhydrase XII Carbonic anhydrase XII (CAXII) | Tumor antigen HOM-RCC-3.1.3
Type:
Enzyme
Mol. Mass.:
39456.00
Organism:
Homo sapiens (Human)
Description:
Catalytic domain of human cloned isozyme was used in the assay
Residue:
354
  
Inhibitor
Name:
BDBM50116389
Synonyms:
CHEMBL3604509
Type:
Small organic molecule
Emp. Form.:
C16H25N3O5S
Mol. Mass.:
371.452
SMILES:
CCCN(CCC)S(=O)(=O)c1ccc(cc1)C(=O)N[C@@H](CO)C(N)=O
: