Target
Metabotropic glutamate receptor 4
Ligand
BDBM50116518
Substrate
Meas. Tech.
ChEMBL_1512615 (CHEMBL3610662)
IC50
145±n/a nM
Citation
 Zhang, ZKil, KEPoutiainen, PChoi, JKKang, HJHuang, XPRoth, BLBrownell, AL Re-exploring the N-phenylpicolinamide derivatives to develop mGlu4 ligands with improved affinity and in vitro microsomal stability. Bioorg Med Chem Lett 25:3956-60 (2015)  
Target
Name:
Metabotropic glutamate receptor 4
Synonyms:
GPRC1D GRM4_HUMAN MGLUR4 Metabotropic glutamate receptor 4 (mGlu4) metabotropic glutamate 4
Type:
Protein
Mol. Mass.:
101899.95
Organism:
Homo sapiens (Human)
Description:
Q14833
Residue:
912
  
Inhibitor
Name:
BDBM50116518
Synonyms:
CHEMBL3609732
Type:
Small organic molecule
Emp. Form.:
C13H11IN2O2
Mol. Mass.:
354.1431
SMILES:
COc1cc(NC(=O)c2ccccn2)ccc1I
: