Target
ALK tyrosine kinase receptor
Ligand
BDBM50116686
Substrate
Meas. Tech.
ChEMBL_1513258 (CHEMBL3610966)
IC50
1500±n/a nM
Citation
 Kang, GALee, MSong, DLee, HKAhn, SPark, CHLee, COYun, CSJung, HKim, PHa, JDCho, SYKim, HRHwang, JY Synthesis and evaluation of novel 2,4-diaminopyrimidines bearing bicyclic aminobenzazepines for anaplastic lymphoma kinase (ALK) inhibitor. Bioorg Med Chem Lett 25:3992-8 (2015)  
Target
Name:
ALK tyrosine kinase receptor
Synonyms:
ALK ALK_HUMAN CD_antigen: CD246
Type:
Protein
Mol. Mass.:
176453.10
Organism:
Homo sapiens (Human)
Description:
Q9UM73
Residue:
1620
  
Inhibitor
Name:
BDBM50116686
Synonyms:
CHEMBL3608313 | US10053458, 63
Type:
Small organic molecule
Emp. Form.:
C29H36ClN5O4S
Mol. Mass.:
586.145
SMILES:
COc1cc2CCCN(Cc2cc1Nc1ncc(Cl)c(Nc2ccccc2S(=O)(=O)C(C)C)n1)C1CCOCC1
: