Target
ALK tyrosine kinase receptor
Ligand
BDBM50116690
Substrate
Meas. Tech.
ChEMBL_1513259 (CHEMBL3610967)
IC50
6100±n/a nM
Citation
 Kang, GALee, MSong, DLee, HKAhn, SPark, CHLee, COYun, CSJung, HKim, PHa, JDCho, SYKim, HRHwang, JY Synthesis and evaluation of novel 2,4-diaminopyrimidines bearing bicyclic aminobenzazepines for anaplastic lymphoma kinase (ALK) inhibitor. Bioorg Med Chem Lett 25:3992-8 (2015)  
Target
Name:
ALK tyrosine kinase receptor
Synonyms:
ALK ALK_HUMAN CD_antigen: CD246
Type:
Protein
Mol. Mass.:
176453.10
Organism:
Homo sapiens (Human)
Description:
Q9UM73
Residue:
1620
  
Inhibitor
Name:
BDBM50116690
Synonyms:
CHEMBL3608528 | US10053458, 67
Type:
Small organic molecule
Emp. Form.:
C26H32ClN5O3S
Mol. Mass.:
530.082
SMILES:
CCN1CCc2cc(Nc3ncc(Cl)c(Nc4ccccc4S(=O)(=O)C(C)C)n3)c(OC)cc2CC1
: