Target
Acyl-CoA (8-3)-desaturase
Ligand
BDBM50116769
Substrate
Meas. Tech.
ChEMBL_1513296 (CHEMBL3611102)
IC50
260±n/a nM
Citation
 Baugh, SDPabba, PKBarbosa, JCoulter, EDesai, UGay, JPGopinathan, SHan, QHari, RKimball, SDNguyen, HVNi, CYPowell, DRSmith, ATerranova, KMWilson, AYu, XCLombardo, VK Design, synthesis, and in vivo activity of novel inhibitors of delta-5 desaturase for the treatment of metabolic syndrome. Bioorg Med Chem Lett 25:3836-9 (2015)  
Target
Name:
Acyl-CoA (8-3)-desaturase
Synonyms:
FADS1 FADSD5 | Fatty acid desaturase 1
Type:
PROTEIN
Mol. Mass.:
51985.80
Organism:
Homo sapiens (Human)
Description:
ChEMBL_1513296
Residue:
444
  
Inhibitor
Name:
BDBM50116769
Synonyms:
CHEMBL3608703
Type:
Small organic molecule
Emp. Form.:
C12H8ClN3S
Mol. Mass.:
261.73
SMILES:
Clc1cccc(Nc2ncnc3sccc23)c1
: