Target
Diacylglycerol O-acyltransferase 1
Ligand
BDBM50117186
Substrate
Meas. Tech.
ChEMBL_1513968 (CHEMBL3616154)
IC50
>10000±n/a nM
Citation
 Pagire, SHPagire, HSLee, GBHan, SJKwak, HJKim, JYKim, KYRhee, SDRyu, JISong, JSBae, MAPark, MJKim, DLee, DHAhn, JH Discovery and optimization of adamantane carboxylic acid derivatives as potent diacylglycerol acyltransferase 1 inhibitors for the potential treatment of obesity and diabetes. Eur J Med Chem 101:716-35 (2015)  
Target
Name:
Diacylglycerol O-acyltransferase 1
Synonyms:
DGAT1_MOUSE Dgat1 Diacylglycerol O-acyltransferase 1 (DGAT1) | Diglyceride acyltransferase
Type:
Enzyme
Mol. Mass.:
56810.61
Organism:
Mus musculus (mouse)
Description:
In this assay, recombinant mouse DGAT-1 containing an N-terminal His6-epitope tag was produced in the baculovirus expression system.
Residue:
498
  
Inhibitor
Name:
BDBM50117186
Synonyms:
CHEMBL3613342
Type:
Small organic molecule
Emp. Form.:
C31H31F3N4O5
Mol. Mass.:
596.5968
SMILES:
OC(=O)C12CC3CC(C1)C(Oc1ccc(cc1)C(=O)NCCNC(=O)c1cn(nc1C(F)(F)F)-c1ccccc1)C(C3)C2
: