Target
LIM domain kinase 1
Ligand
BDBM50117627
Substrate
Meas. Tech.
ChEMBL_1514397 (CHEMBL3615476)
IC50
31±n/a nM
Citation
 Boland, SBourin, AAlen, JGeraets, JSchroeders, PCastermans, KKindt, NBoumans, NPanitti, LVanormelingen, JFransen, SVan de Velde, SDefert, O Design, synthesis and biological characterization of selective LIMK inhibitors. Bioorg Med Chem Lett 25:4005-10 (2015)  
Target
Name:
LIM domain kinase 1
Synonyms:
LIMK LIMK1 | LIMK1_HUMAN
Type:
Enzyme Catalytic Domain
Mol. Mass.:
72591.81
Organism:
Homo sapiens (Human)
Description:
gi_4505001
Residue:
647
  
Inhibitor
Name:
BDBM50117627
Synonyms:
CHEMBL3613614
Type:
Small organic molecule
Emp. Form.:
C20H22N6O3
Mol. Mass.:
394.4271
SMILES:
COC(=O)c1cccc(NC(=O)C2(N)CCN(CC2)c2ncnc3[nH]ccc23)c1
: