Target
Transient receptor potential cation channel subfamily V member 4
Ligand
BDBM50117636
Substrate
Meas. Tech.
ChEMBL_1514430 (CHEMBL3615626)
IC50
320±n/a nM
Citation
 Wei, ZLNguyen, MTO'Mahony, DJAcevedo, AZipfel, SZhang, QLiu, LDourado, MChi, CYip, VDeFalco, JGustafson, AEmerling, DEKelly, MGKincaid, JVincent, FDuncton, MA Identification of orally-bioavailable antagonists of the TRPV4 ion-channel. Bioorg Med Chem Lett 25:4011-5 (2015)  
Target
Name:
Transient receptor potential cation channel subfamily V member 4
Synonyms:
TRPV4_MOUSE Trpv4 Vroac
Type:
PROTEIN
Mol. Mass.:
98032.61
Organism:
Mus musculus
Description:
ChEMBL_1514430
Residue:
871
  
Inhibitor
Name:
BDBM50117636
Synonyms:
CHEMBL3613642
Type:
Small organic molecule
Emp. Form.:
C21H23F3N4O5S
Mol. Mass.:
500.491
SMILES:
CC(C)N1CCN(CC1)S(=O)(=O)c1ccc(NC(=O)c2ccc(cc2[N+]([O-])=O)C(F)(F)F)cc1
: