Target
Menin
Ligand
BDBM50117750
Substrate
Meas. Tech.
ChEMBL_1515211 (CHEMBL3614558)
IC50
46±n/a nM
Citation
 Pollock, JBorkin, DLund, GPurohit, TDyguda-Kazimierowicz, EGrembecka, JCierpicki, T Rational Design of Orthogonal Multipolar Interactions with Fluorine in Protein-Ligand Complexes. J Med Chem 58:7465-74 (2015)  
Target
Name:
Menin
Synonyms:
MEN1 Menin/Histone-lysine N-methyltransferase MLL | SCG2
Type:
Protein
Mol. Mass.:
68022.55
Organism:
Homo sapiens (Human)
Description:
O00255
Residue:
615
  
Inhibitor
Name:
BDBM50117750
Synonyms:
CHEMBL3586090
Type:
Small organic molecule
Emp. Form.:
C17H20F3N5S2
Mol. Mass.:
415.499
SMILES:
CC1(C)CN=C(S1)N1CCN(CC1)c1ncnc2sc(CC(F)(F)F)cc12
: