Target
cGMP-inhibited 3',5'-cyclic phosphodiesterase 3A
Ligand
BDBM50117856
Substrate
Meas. Tech.
ChEMBL_1515963 (CHEMBL3615166)
IC50
8150±n/a nM
Citation
 Duan, LMYu, HYLi, YLJia, CJ Design and discovery of 2-(4-(1H-tetrazol-5-yl)-1H-pyrazol-1-yl)-4-(4-phenyl)thiazole derivatives as cardiotonic agents via inhibition of PDE3. Bioorg Med Chem 23:6111-7 (2015)  
Target
Name:
cGMP-inhibited 3',5'-cyclic phosphodiesterase 3A
Synonyms:
3',5'-cyclic phosphodiesterase Cyclic GMP-inhibited phosphodiesterase A PDE3A_HUMAN Phosphodiesterase 3 (PDE3) Phosphodiesterase 3A Phosphodiesterase 3A (PDE3A1) cGMP-inhibited 3',5'-cyclic phosphodiesterase A | cGMP-inhibited 3,5-cyclic phosphodiesterase A
Type:
Enzyme
Mol. Mass.:
124966.46
Organism:
Homo sapiens (Human)
Description:
Q14432
Residue:
1141
  
Inhibitor
Name:
BDBM50117856
Synonyms:
CHEMBL3614031
Type:
Small organic molecule
Emp. Form.:
C14H11N7S
Mol. Mass.:
309.349
SMILES:
Cc1ccc(cc1)-c1csc(n1)-n1cc(cn1)-c1nnn[nH]1
: