Target
cGMP-inhibited 3',5'-cyclic phosphodiesterase 3B
Ligand
BDBM50016980
Substrate
Meas. Tech.
ChEMBL_1515964 (CHEMBL3615167)
IC50
14540±n/a nM
Citation
 Duan, LMYu, HYLi, YLJia, CJ Design and discovery of 2-(4-(1H-tetrazol-5-yl)-1H-pyrazol-1-yl)-4-(4-phenyl)thiazole derivatives as cardiotonic agents via inhibition of PDE3. Bioorg Med Chem 23:6111-7 (2015)  
Target
Name:
cGMP-inhibited 3',5'-cyclic phosphodiesterase 3B
Synonyms:
CGI-PDE B CGIPDE1 PDE3B Phosphodiesterase 3B Phosphodiesterase Type 3 (PDE3B) cGMP-inhibited 3,5-cyclic phosphodiesterase B
Type:
Enzyme
Mol. Mass.:
124318.95
Organism:
Homo sapiens (Human)
Description:
PDE3B was generated from the full-length recombinant human clone transfected into Sf9 cells.
Residue:
1112
  
Inhibitor
Name:
BDBM50016980
Synonyms:
6-(4-(3,4-dimethoxybenzoyl)piperazin-1-yl)-3,4-dihydroquinolin-2(1H)-one 6-[4-(3,4-Dimethoxy-benzoyl)-piperazin-1-yl]-3,4-dihydro-1H-quinolin-2-one(OPC-8212) VESNARINONE | [4-(3,4-Dihydro-quinolin-6-yl)-piperazin-1-yl]-(3,4-dimethoxy-phenyl)-methanone
Type:
Small organic molecule
Emp. Form.:
C22H25N3O4
Mol. Mass.:
395.4516
SMILES:
COc1ccc(cc1OC)C(=O)N1CCN(CC1)c1ccc2NC(=O)CCc2c1
: