Target
Amine oxidase [flavin-containing] B
Ligand
BDBM50117998
Substrate
Meas. Tech.
ChEMBL_1514156 (CHEMBL3614599)
IC50
>10000±n/a nM
Citation
 Choi, JWJang, BKCho, NCPark, JHYeon, SKJu, EJLee, YSHan, GPae, ANKim, DJPark, KD Synthesis of a series of unsaturated ketone derivatives as selective and reversible monoamine oxidase inhibitors. Bioorg Med Chem 23:6486-96 (2015)  
Target
Name:
Amine oxidase [flavin-containing] B
Synonyms:
AOFB_HUMAN MAOB Monoamine oxidase type B (MAO B) Monoamine oxidase type B (MAOB)
Type:
Protein
Mol. Mass.:
58768.76
Organism:
Homo sapiens (Human)
Description:
P27338
Residue:
520
  
Inhibitor
Name:
BDBM50117998
Synonyms:
CHEMBL585432 | GNF-Pf-930
Type:
Small organic molecule
Emp. Form.:
C16H14ClNO2
Mol. Mass.:
287.741
SMILES:
COc1ccc(NC(=O)\C=C\c2ccccc2Cl)cc1
: