Target
Tyrosine-protein kinase BTK
Ligand
BDBM50118163
Substrate
Meas. Tech.
ChEMBL_1514628 (CHEMBL3614375)
IC50
2867±n/a nM
Citation
 Xin, MZhao, XHuang, WJin, QWu, GWang, YTang, FXiang, H Synthesis and biological evaluation of novel 7-substituted 3-(4-phenoxyphenyl)thieno[3,2-c]pyridin-4-amines as potent Bruton's tyrosine kinase (BTK) inhibitors. Bioorg Med Chem 23:6250-7 (2015)  
Target
Name:
Tyrosine-protein kinase BTK
Synonyms:
AGMX1 Agammaglobulinaemia tyrosine kinase B cell progenitor kinase BPK BTK_HUMAN Tyrosine Kinase BTK Tyrosine-protein kinase BTK (BTK)
Type:
Enzyme
Mol. Mass.:
76289.95
Organism:
Homo sapiens (Human)
Description:
Q06187
Residue:
659
  
Inhibitor
Name:
BDBM50118163
Synonyms:
CHEMBL3612849
Type:
Small organic molecule
Emp. Form.:
C29H29N3O3S
Mol. Mass.:
499.624
SMILES:
CC(C)(C)OC(=O)N1CCCC(=C1)c1cnc(N)c2c(csc12)-c1ccc(Oc2ccccc2)cc1
: