Target
Serine/threonine-protein kinase TNNI3K
Ligand
BDBM50118411
Substrate
Meas. Tech.
ChEMBL_1514933 (CHEMBL3615799)
IC50
40±n/a nM
Citation
 Lawhorn, BGPhilp, JZhao, YLouer, CHammond, MCheung, MFries, HGraves, APShewchuk, LWang, LCottom, JEQi, HZhao, HTotoritis, RZhang, GSchwartz, BLi, HSweitzer, SHolt, DAGatto, GJKallander, LS Identification of Purines and 7-Deazapurines as Potent and Selective Type I Inhibitors of Troponin I-Interacting Kinase (TNNI3K). J Med Chem 58:7431-48 (2015)  
Target
Name:
Serine/threonine-protein kinase TNNI3K
Synonyms:
CARK TNI3K_HUMAN | TNNI3K
Type:
Enzyme Catalytic Domain
Mol. Mass.:
92855.14
Organism:
Homo sapiens (Human)
Description:
gi_7705748
Residue:
835
  
Inhibitor
Name:
BDBM50118411
Synonyms:
CHEMBL3612661
Type:
Small organic molecule
Emp. Form.:
C14H15N5O2S
Mol. Mass.:
317.366
SMILES:
CNS(=O)(=O)c1cccc(Nc2ncnc3[nH]cc(C)c23)c1
: