Target
Sodium channel protein type 8 subunit alpha
Ligand
BDBM50118518
Substrate
Meas. Tech.
ChEMBL_1516891 (CHEMBL3618944)
IC50
240±n/a nM
Citation
 de Lera Ruiz, MKraus, RL Voltage-Gated Sodium Channels: Structure, Function, Pharmacology, and Clinical Indications. J Med Chem 58:7093-118 (2015)  
Target
Name:
Sodium channel protein type 8 subunit alpha
Synonyms:
Nbna1 Scn8a Voltage-gated sodium channel subunit alpha Nav1.6
Type:
PROTEIN
Mol. Mass.:
225132.11
Organism:
Mus musculus
Description:
ChEMBL_1516891
Residue:
1978
  
Inhibitor
Name:
BDBM50118518
Synonyms:
CHEMBL3617066
Type:
Small organic molecule
Emp. Form.:
C70H105N27O23S6
Mol. Mass.:
1885.14
SMILES:
[H][C@@]12CSSC[C@]3([H])NC(=O)[C@H](CCCNC(N)=N)NC(=O)[C@H](CO)NC(=O)[C@H](Cc4cnc[nH]4)NC(=O)[C@H](CC(O)=O)NC(=O)[C@H](CCCNC(N)=N)NC(=O)[C@]([H])(CSSC[C@H](N)C(=O)N1)NC(=O)[C@H](Cc1c[nH]c4ccccc14)NC(=O)[C@H](CCCCN)NC(=O)[C@H](CO)NC(=O)[C@H](CO)NC(=O)[C@]([H])(CSSC[C@H](NC3=O)C(O)=O)NC(=O)[C@H](CC(N)=O)NC2=O
: