Target
Acetylcholinesterase
Ligand
BDBM50118956
Substrate
Meas. Tech.
ChEMBL_1518225 (CHEMBL3619983)
IC50
21350±n/a nM
Citation
 Kurt, BZGazioglu, IBasile, LSonmez, FGinex, TKucukislamoglu, MGuccione, S Potential of aryl-urea-benzofuranylthiazoles hybrids as multitasking agents in Alzheimer's disease. Eur J Med Chem 102:80-92 (2015)  
Target
Name:
Acetylcholinesterase
Synonyms:
ACES_ELEEL Acetylcholinesterase (EeAChE) | ache
Type:
Enzyme
Mol. Mass.:
71812.79
Organism:
Electrophorus electricus (Electric eel)
Description:
Residue:
633
  
Inhibitor
Name:
BDBM50118956
Synonyms:
CHEMBL3617377
Type:
Small organic molecule
Emp. Form.:
C18H12IN3O2S
Mol. Mass.:
461.276
SMILES:
Ic1ccc(NC(=O)Nc2nc(cs2)-c2cc3ccccc3o2)cc1
: