Target
5-hydroxytryptamine receptor 1F
Ligand
BDBM50119532
Substrate
Meas. Tech.
ChEMBL_1518525 (CHEMBL3618911)
EC50
110±n/a nM
Citation
 Zhang, DBlanco, MJYing, BPKohlman, DLiang, SXVictor, FChen, QKrushinski, JFilla, SAHudziak, KJMathes, BMCohen, MPZacherl, DNelson, DLWainscott, DBNutter, SEGough, WHSchaus, JMXu, YC Discovery of selective N-[3-(1-methyl-piperidine-4-carbonyl)-phenyl]-benzamide-based 5-HT1 F receptor agonists: Evolution from bicyclic to monocyclic cores. Bioorg Med Chem Lett 25:4337-41 (2015)  
Target
Name:
5-hydroxytryptamine receptor 1F
Synonyms:
5-HT-1F 5-hydroxytryptamine receptor 1F HTR1EL Serotonin (5-HT) receptor Serotonin receptor 1F
Type:
Enzyme Catalytic Domain
Mol. Mass.:
41724.68
Organism:
Homo sapiens (Human)
Description:
5-HT1F HTR1F HUMAN::P30939
Residue:
366
  
Inhibitor
Name:
BDBM50119532
Synonyms:
CHEMBL3617557
Type:
Small organic molecule
Emp. Form.:
C19H20FN3O2
Mol. Mass.:
341.3794
SMILES:
CN1CCC(CC1)C(=O)c1cccc(NC(=O)c2ccc(F)cc2)n1
: