Target
Glucagon receptor
Ligand
BDBM50120319
Substrate
Meas. Tech.
ChEMBL_1518284 (CHEMBL3620259)
IC50
1.000000±n/a nM
Citation
 Lin, SZhang, FJiang, GQureshi, SAYang, XChicchi, GGTota, LBansal, ABrady, ETrujillo, MSalituro, GMiller, CTata, JRZhang, BBParmee, ER A novel series of indazole-/indole-based glucagon receptor antagonists. Bioorg Med Chem Lett 25:4143-7 (2015)  
Target
Name:
Glucagon receptor
Synonyms:
GCGR GLR_HUMAN Glucagon receptor (GlucR)
Type:
Enzyme
Mol. Mass.:
54026.92
Organism:
Homo sapiens (Human)
Description:
P47871
Residue:
477
  
Inhibitor
Name:
BDBM50120319
Synonyms:
CHEMBL3616588
Type:
Small organic molecule
Emp. Form.:
C36H31F6N3O5
Mol. Mass.:
699.6389
SMILES:
CCCC(c1ccc(cc1)C(=O)NCCC(O)=O)n1nc(-c2cc(ccc2OC)C(F)(F)F)c2ccc(cc12)-c1ccc(OC(F)(F)F)cc1
: