Target
Nuclear factor erythroid 2-related factor 2
Ligand
BDBM50120411
Substrate
Meas. Tech.
ChEMBL_1517687 (CHEMBL3620075)
EC50
11300±n/a nM
Citation
 Bertrand, HCSchaap, MBaird, LGeorgakopoulos, NDFowkes, AThiollier, CKachi, HDinkova-Kostova, ATWells, G Design, Synthesis, and Evaluation of Triazole Derivatives That Induce Nrf2 Dependent Gene Products and Inhibit the Keap1-Nrf2 Protein-Protein Interaction. J Med Chem 58:7186-94 (2015)  
Target
Name:
Nuclear factor erythroid 2-related factor 2
Synonyms:
HEBP1 NF-E2-related factor 2 NFE2-related factor 2 NRF2 Nuclear factor, erythroid derived 2, like 2
Type:
PROTEIN
Mol. Mass.:
67786.89
Organism:
Homo sapiens (Human)
Description:
ChEMBL_107924
Residue:
605
  
Inhibitor
Name:
BDBM50120411
Synonyms:
CHEMBL3617829
Type:
Small organic molecule
Emp. Form.:
C16H14N4O3
Mol. Mass.:
310.3074
SMILES:
CCOc1cccc(c1)-n1cc(nn1)-c1cccc(c1)[N+]([O-])=O
: