Target
Nuclear factor erythroid 2-related factor 2
Ligand
BDBM50120420
Substrate
Meas. Tech.
ChEMBL_1517689 (CHEMBL3620077)
EC50
9800±n/a nM
Citation
 Bertrand, HCSchaap, MBaird, LGeorgakopoulos, NDFowkes, AThiollier, CKachi, HDinkova-Kostova, ATWells, G Design, Synthesis, and Evaluation of Triazole Derivatives That Induce Nrf2 Dependent Gene Products and Inhibit the Keap1-Nrf2 Protein-Protein Interaction. J Med Chem 58:7186-94 (2015)  
Target
Name:
Nuclear factor erythroid 2-related factor 2
Synonyms:
HEBP1 NF-E2-related factor 2 NFE2-related factor 2 NRF2 Nuclear factor, erythroid derived 2, like 2
Type:
PROTEIN
Mol. Mass.:
67786.89
Organism:
Homo sapiens (Human)
Description:
ChEMBL_107924
Residue:
605
  
Inhibitor
Name:
BDBM50120420
Synonyms:
CHEMBL3134423
Type:
Small organic molecule
Emp. Form.:
C25H18N4O7
Mol. Mass.:
486.433
SMILES:
OC(=O)c1ccc(cc1)-c1ccc(\C=N\NC(=O)N\N=C\c2ccc(o2)-c2ccc(cc2)C(O)=O)o1
: