Target
Neutrophil elastase
Ligand
BDBM50120437
Substrate
Meas. Tech.
ChEMBL_1517852 (CHEMBL3620648)
Ki
0.080000±n/a nM
Citation
 von Nussbaum, FLi, VM Neutrophil elastase inhibitors for the treatment of (cardio)pulmonary diseases: Into clinical testing with pre-adaptive pharmacophores. Bioorg Med Chem Lett 25:4370-81 (2015)  
Target
Name:
Neutrophil elastase
Synonyms:
Bone marrow serine protease Coagulation factor X ELANE Elastase HLE Leukocyte elastase Medullasin Neutrophil elastase (HNE) PMN elastase Trypsin
Type:
Enzyme
Mol. Mass.:
28532.38
Organism:
Homo sapiens (Human)
Description:
P08246
Residue:
267
  
Inhibitor
Name:
BDBM50120437
Synonyms:
CHEMBL3617973
Type:
Small organic molecule
Emp. Form.:
C22H17F3N4O3S
Mol. Mass.:
474.456
SMILES:
CN1[C@@H](C(C#N)=C(C)N(C1=O)c1cccc(c1)C(F)(F)F)c1ccc(cc1S(C)(=O)=O)C#N
: