Target
Bifunctional epoxide hydrolase 2
Ligand
BDBM50085551
Substrate
Meas. Tech.
ChEMBL_1517873 (CHEMBL3620669)
IC50
26800±n/a nM
Citation
 Sun, YNKim, JHLi, WJo, ARYan, XTYang, SYKim, YH Soluble epoxide hydrolase inhibitory activity of anthraquinone components from Aloe. Bioorg Med Chem 23:6659-65 (2015)  
Target
Name:
Bifunctional epoxide hydrolase 2
Synonyms:
Cytosolic epoxide hydrolase 2 EPHX2 HYES_HUMAN Soluble epoxide hydrolase (sEH) | epoxide hydrolase 2, cytoplasmic
Type:
Enzyme
Mol. Mass.:
62613.07
Organism:
Homo sapiens (Human)
Description:
P34913
Residue:
555
  
Inhibitor
Name:
BDBM50085551
Synonyms:
1,8-Dihydroxy-3-hydroxymethyl-anthraquinone CHEMBL40275 aloe-emodin | cid_10207
Type:
Small organic molecule
Emp. Form.:
C15H10O5
Mol. Mass.:
270.2369
SMILES:
OCc1cc(O)c2C(=O)c3c(O)cccc3C(=O)c2c1
: