Target
Bifunctional epoxide hydrolase 2
Ligand
BDBM50120489
Substrate
Meas. Tech.
ChEMBL_1517874 (CHEMBL3620670)
Ki
800±n/a nM
Citation
 Sun, YNKim, JHLi, WJo, ARYan, XTYang, SYKim, YH Soluble epoxide hydrolase inhibitory activity of anthraquinone components from Aloe. Bioorg Med Chem 23:6659-65 (2015)  
Target
Name:
Bifunctional epoxide hydrolase 2
Synonyms:
Cytosolic epoxide hydrolase 2 EPHX2 HYES_HUMAN Soluble epoxide hydrolase (sEH) | epoxide hydrolase 2, cytoplasmic
Type:
Enzyme
Mol. Mass.:
62613.07
Organism:
Homo sapiens (Human)
Description:
P34913
Residue:
555
  
Inhibitor
Name:
BDBM50120489
Synonyms:
CHEMBL3617997
Type:
Small organic molecule
Emp. Form.:
C26H30O12
Mol. Mass.:
534.5092
SMILES:
[H][C@]1(OC[C@@H](O)[C@H](O)[C@H]1O)[C@]1([H])c2cccc(O)c2C(=O)c2c(O)cc(CO[C@@H]3O[C@@H](C)[C@H](O)[C@@H](O)[C@H]3O)cc12
: