Target
Bifunctional epoxide hydrolase 2
Ligand
BDBM50120492
Substrate
Meas. Tech.
ChEMBL_1517875 (CHEMBL3620671)
Ki
27800±n/a nM
Citation
 Sun, YNKim, JHLi, WJo, ARYan, XTYang, SYKim, YH Soluble epoxide hydrolase inhibitory activity of anthraquinone components from Aloe. Bioorg Med Chem 23:6659-65 (2015)  
Target
Name:
Bifunctional epoxide hydrolase 2
Synonyms:
Cytosolic epoxide hydrolase 2 EPHX2 HYES_HUMAN Soluble epoxide hydrolase (sEH) | epoxide hydrolase 2, cytoplasmic
Type:
Enzyme
Mol. Mass.:
62613.07
Organism:
Homo sapiens (Human)
Description:
P34913
Residue:
555
  
Inhibitor
Name:
BDBM50120492
Synonyms:
CHEMBL3617994
Type:
Small organic molecule
Emp. Form.:
C21H22O9
Mol. Mass.:
418.394
SMILES:
[H][C@]1(O[C@H](CO)[C@@H](O)[C@H](O)[C@H]1O)[C@]1([H])c2cccc(O)c2C(=O)c2c(O)cc(CO)cc12
: