Target
Alpha-amylase 1A
Ligand
BDBM50120836
Substrate
Meas. Tech.
ChEMBL_1516310 (CHEMBL3618750)
IC50
260000±n/a nM
Citation
 Al-Asri, JFazekas, ELehoczki, GPerdih, AGörick, CMelzig, MFGyémánt, GWolber, GMortier, J From carbohydrates to drug-like fragments: Rational development of novela-amylase inhibitors. Bioorg Med Chem 23:6725-32 (2015)  
Target
Name:
Alpha-amylase 1A
Synonyms:
1,4-alpha-D-glucan glucanohydrolase 1 AMY1A Alpha-amylase | Salivary alpha-amylase
Type:
Glycosidase
Mol. Mass.:
57770.18
Organism:
Homo sapiens (Human)
Description:
Purchased from Sigma Chemical Co.
Residue:
511
  
Inhibitor
Name:
BDBM50120836
Synonyms:
CHEMBL572150
Type:
Small organic molecule
Emp. Form.:
C18H13BrN2O5S
Mol. Mass.:
449.275
SMILES:
COc1cc(Br)cc(\C=C2\SC(Nc3cccc(c3)C(O)=O)=NC2=O)c1O
: