Target
Alpha-amylase 1A
Ligand
BDBM50312869
Substrate
Meas. Tech.
ChEMBL_1516310 (CHEMBL3618750)
IC50
1043000±n/a nM
Citation
 Al-Asri, JFazekas, ELehoczki, GPerdih, AGörick, CMelzig, MFGyémánt, GWolber, GMortier, J From carbohydrates to drug-like fragments: Rational development of novela-amylase inhibitors. Bioorg Med Chem 23:6725-32 (2015)  
Target
Name:
Alpha-amylase 1A
Synonyms:
1,4-alpha-D-glucan glucanohydrolase 1 AMY1A Alpha-amylase | Salivary alpha-amylase
Type:
Glycosidase
Mol. Mass.:
57770.18
Organism:
Homo sapiens (Human)
Description:
Purchased from Sigma Chemical Co.
Residue:
511
  
Inhibitor
Name:
BDBM50312869
Synonyms:
4-(4-(4-chlorophenyl)thiazol-2-ylamino)phenol N-aryl-4-aryl-1,3-thiazole-2-amine, 5
Type:
Small organic molecule
Emp. Form.:
C15H11ClN2OS
Mol. Mass.:
302.779
SMILES:
Oc1ccc(Nc2nc(cs2)-c2ccc(Cl)cc2)cc1
: