Target
Pancreatic alpha-amylase
Ligand
BDBM29143
Substrate
Meas. Tech.
ChEMBL_1516328 (CHEMBL3618920)
Ki
48000±n/a nM
Citation
 Al-Asri, JFazekas, ELehoczki, GPerdih, AGörick, CMelzig, MFGyémánt, GWolber, GMortier, J From carbohydrates to drug-like fragments: Rational development of novela-amylase inhibitors. Bioorg Med Chem 23:6725-32 (2015)  
Target
Name:
Pancreatic alpha-amylase
Synonyms:
1,4-alpha-D-glucan glucanohydrolase AMYP_PIG Pancreatic α-amylase
Type:
Protein
Mol. Mass.:
57088.07
Organism:
Sus scrofa (Pig)
Description:
P00690
Residue:
511
  
Inhibitor
Name:
BDBM29143
Synonyms:
CHEMBL7976 Chalcone, 13 substituted chalcone, 5j
Type:
Small organic molecule
Emp. Form.:
C15H12O
Mol. Mass.:
208.2552
SMILES:
O=C(\C=C\c1ccccc1)c1ccccc1
: