Target
Potassium voltage-gated channel subfamily A member 5
Ligand
BDBM50120904
Substrate
Meas. Tech.
ChEMBL_1520751 (CHEMBL3625774)
IC50
34±n/a nM
Citation
 Lloyd, JFinlay, HJKover, AJohnson, JPi, ZJiang, JNeels, JCavallaro, CWexler, RConder, MLShi, HLi, DSun, HChimalakonda, AHuang, CSalvati, MLevesque, P Pseudosaccharin amines as potent and selective KV1.5 blockers. Bioorg Med Chem Lett 25:4983-6 (2015)  
Target
Name:
Potassium voltage-gated channel subfamily A member 5
Synonyms:
HK2 KCNA5 Potassium voltage-gated channel subfamily A member 5 Voltage-gated potassium channel subunit Kv1.5
Type:
Enzyme
Mol. Mass.:
67222.47
Organism:
Homo sapiens (Human)
Description:
P22460
Residue:
613
  
Inhibitor
Name:
BDBM50120904
Synonyms:
CHEMBL3622346
Type:
Small organic molecule
Emp. Form.:
C21H24N2O4S
Mol. Mass.:
400.491
SMILES:
COc1cccc2c1C(NC[C@@]1(CC[C@H](O)CC1)c1ccccc1)=NS2(=O)=O
: